{"text_format":"1","workbook":"xlsx","n_sheets":4,"sheets":["Master Tally","1-George_Loffredo20151016","2-Siemen_Loffredo20151016","3-Strine_Bartram20151016"],"not_rendered":{"charts":0,"images":24,"macros":1,"external_links":0,"defined_names":2,"comments":0,"pivot_tables":0},"unopened":[],"bounds":{"document_bytes":16777216,"sheet_cells":100000,"rows_first":2000,"rows_last":500,"rows_between":2000,"halvings":0,"cell_chars":16384,"cell_head_chars":4096},"cells_cut":0,"cells_raw":0,"read":"whole","date_system":"1900"}

{"sheet":"Master Tally","index":0,"n_rows":36,"n_cols":8,"rows_kept":36,"cut":false,"hidden":false,"merged":[]}
[]
[]
[]
[]
[null,null,"Event:","Westlake Inc"]
[null,null,"TF/Team:","CaTF2"]
[null,null,"Ops Period:","10-16-2015p1"]
[null,null,"Comments:","Leona & Lake Hughs"]
[]
[null,null,"Symbol","Description",null,"Total Number of Symbols in all Sheets"]
[null,1,null,"Structure No Damage",null,{"$f":"SUMPRODUCT(COUNTIF(INDIRECT(\"'\"&AllSheets&\"'!C:C\"),\"Structure No Damage\"))","v":160}]
[null,{"$f":"B11+1","v":2},null,"Structure Damaged",null,{"$f":"SUMPRODUCT(COUNTIF(INDIRECT(\"'\"&AllSheets&\"'!C:C\"),\"Structure Damaged\"))","v":1}]
[null,{"$f":"B12+1","v":3},null,"Structure Failed",null,{"$f":"SUMPRODUCT(COUNTIF(INDIRECT(\"'\"&AllSheets&\"'!C:C\"),\"Structure Failed\"))","v":0}]
[null,4,null,"Structure Destroyed",null,{"$f":"SUMPRODUCT(COUNTIF(INDIRECT(\"'\"&AllSheets&\"'!C:C\"),\"Structure Destroyed\"))","v":0},{"$f":"SUM(F11:F14)","v":161},"All Structures Searched"]
[null,5,null,"Assisted",null,{"$f":"SUMPRODUCT(COUNTIF(INDIRECT(\"'\"&AllSheets&\"'!C:C\"),\"Assisted\"))","v":0}]
[null,6,null,"Evacuated",null,{"$f":"SUMPRODUCT(COUNTIF(INDIRECT(\"'\"&AllSheets&\"'!C:C\"),\"Evacuated\"))","v":0}]
[null,7,null,"Rescued",null,{"$f":"SUMPRODUCT(COUNTIF(INDIRECT(\"'\"&AllSheets&\"'!C:C\"),\"Rescued\"))","v":0}]
[null,8,null,"Follow-Up Form",null,{"$f":"SUMPRODUCT(COUNTIF(INDIRECT(\"'\"&AllSheets&\"'!C:C\"),\"Follow-Up Form\"))","v":0}]
[null,9,null,"Victim Detected",null,{"$f":"SUMPRODUCT(COUNTIF(INDIRECT(\"'\"&AllSheets&\"'!C:C\"),\"Victim Detected\"))","v":0}]
[null,10,null,"Confirmed Victim",null,{"$f":"SUMPRODUCT(COUNTIF(INDIRECT(\"'\"&AllSheets&\"'!C:C\"),\"Confirmed Victim\"))","v":0}]
[null,11,null,"Human Remains",null,{"$f":"SUMPRODUCT(COUNTIF(INDIRECT(\"'\"&AllSheets&\"'!C:C\"),\"Human Remains\"))","v":0}]
[null,12,null,"Human Remains Removed",null,{"$f":"SUMPRODUCT(COUNTIF(INDIRECT(\"'\"&AllSheets&\"'!C:C\"),\"Human Remains Removed\"))","v":0}]
[null,13,null,"Shelter in Place",null,{"$f":"SUMPRODUCT(COUNTIF(INDIRECT(\"'\"&AllSheets&\"'!C:C\"),\"Shelter in Place\"))","v":29}]
[null,14,null,"Animal Issue",null,{"$f":"SUMPRODUCT(COUNTIF(INDIRECT(\"'\"&AllSheets&\"'!C:C\"),\"Animal Issue\"))","v":20}]
[null,15,null,"Fire Incident",null,{"$f":"SUMPRODUCT(COUNTIF(INDIRECT(\"'\"&AllSheets&\"'!C:C\"),\"Fire Incident\"))","v":0}]
[null,16,null,"Hazardous Material Incident",null,{"$f":"SUMPRODUCT(COUNTIF(INDIRECT(\"'\"&AllSheets&\"'!C:C\"),\"Hazardous Material Incident\"))","v":0}]
[null,17,null,"Targeted Search",null,{"$f":"SUMPRODUCT(COUNTIF(INDIRECT(\"'\"&AllSheets&\"'!C:C\"),\"Targeted Search\"))","v":0}]
[null,18,null,"Flood/Water Level",null,{"$f":"SUMPRODUCT(COUNTIF(INDIRECT(\"'\"&AllSheets&\"'!C:C\"),\"Flood/Water Level\"))","v":1}]
[null,19,null,"Helicopter Landing Site",null,{"$f":"SUMPRODUCT(COUNTIF(INDIRECT(\"'\"&AllSheets&\"'!C:C\"),\"Helicopter Landing Site\"))","v":0}]
[null,20,null,"Route Blocked",null,{"$f":"SUMPRODUCT(COUNTIF(INDIRECT(\"'\"&AllSheets&\"'!C:C\"),\"Route Blocked\"))","v":7}]
{"$rows_left_out":7}
{"sheet":"1-George_Loffredo20151016","index":1,"n_rows":44,"n_cols":8,"rows_kept":44,"cut":false,"hidden":false,"merged":[]}
["filename","name","meaning","time","lat","long","usng","elevation"]
["C:\\Users\\Fire\\Desktop\\FEMA Inc Converter\\GPX2KMZ Open Converter\\Output\\George_Loffredo20151016.csv",1,"Structure No Damage","2015-10-16T19:25:36Z",34.665332995355101,-118.45531697385,"11S LU 66656 36894",956.02514599999904]
["C:\\Users\\Fire\\Desktop\\FEMA Inc Converter\\GPX2KMZ Open Converter\\Output\\George_Loffredo20151016.csv",2,"Structure No Damage","2015-10-16T19:45:40Z",34.669494023546498,-118.45338603481601,"11S LU 66840 37353",958.92913799999906]
["C:\\Users\\Fire\\Desktop\\FEMA Inc Converter\\GPX2KMZ Open Converter\\Output\\George_Loffredo20151016.csv",3,"Structure No Damage","2015-10-16T19:50:30Z",34.6697869710624,-118.454109979793,"11S LU 66774 37386",967.37652600000001]
["C:\\Users\\Fire\\Desktop\\FEMA Inc Converter\\GPX2KMZ Open Converter\\Output\\George_Loffredo20151016.csv",34,"Flood/Water Level","2015-10-16T19:22:17Z",34.665320003405199,-118.455308005213,"11S LU 66657 36893",954.34344499999895]
["C:\\Users\\Fire\\Desktop\\FEMA Inc Converter\\GPX2KMZ Open Converter\\Output\\George_Loffredo20151016.csv",35,"Structure No Damage","2015-10-16T20:47:49Z",34.676231984048997,-118.454582970589,"11S LU 66741 38102",985.35253899999896]
["C:\\Users\\Fire\\Desktop\\FEMA Inc Converter\\GPX2KMZ Open Converter\\Output\\George_Loffredo20151016.csv",4,"Structure No Damage","2015-10-16T19:57:45Z",34.672202970832501,-118.45571997575399,"11S LU 66630 37656",986.06872599999895]
["C:\\Users\\Fire\\Desktop\\FEMA Inc Converter\\GPX2KMZ Open Converter\\Output\\George_Loffredo20151016.csv",5,"Structure No Damage","2015-10-16T19:58:46Z",34.672343032434497,-118.455825001001,"11S LU 66621 37672",986.235229]
["C:\\Users\\Fire\\Desktop\\FEMA Inc Converter\\GPX2KMZ Open Converter\\Output\\George_Loffredo20151016.csv",6,"Structure No Damage","2015-10-16T19:59:26Z",34.672402041032903,-118.455768004059,"11S LU 66626 37679",985.57605000000001]
["C:\\Users\\Fire\\Desktop\\FEMA Inc Converter\\GPX2KMZ Open Converter\\Output\\George_Loffredo20151016.csv",8,"Structure No Damage","2015-10-16T20:06:03Z",34.673758987337301,-118.45591996796399,"11S LU 66615 37829",981.79003899999896]
["C:\\Users\\Fire\\Desktop\\FEMA Inc Converter\\GPX2KMZ Open Converter\\Output\\George_Loffredo20151016.csv",9,"Structure No Damage","2015-10-16T20:06:57Z",34.673690004274199,-118.45589599572099,"11S LU 66617 37822",981.12530500000003]
["C:\\Users\\Fire\\Desktop\\FEMA Inc Converter\\GPX2KMZ Open Converter\\Output\\George_Loffredo20151016.csv",10,"Structure No Damage","2015-10-16T20:08:12Z",34.673198992386403,-118.45593698322701,"11S LU 66612 37767",984.90887499999894]
["C:\\Users\\Fire\\Desktop\\FEMA Inc Converter\\GPX2KMZ Open Converter\\Output\\George_Loffredo20151016.csv",11,"Structure No Damage","2015-10-16T20:15:54Z",34.676728025078702,-118.457902036607,"11S LU 66438 38161",996.67681900000002]
["C:\\Users\\Fire\\Desktop\\FEMA Inc Converter\\GPX2KMZ Open Converter\\Output\\George_Loffredo20151016.csv",12,"Shelter in Place","2015-10-16T20:44:12Z",34.676091000437701,-118.454981027171,"11S LU 66704 38087",985.45013400000005]
["C:\\Users\\Fire\\Desktop\\FEMA Inc Converter\\GPX2KMZ Open Converter\\Output\\George_Loffredo20151016.csv",13,"Structure No Damage","2015-10-16T20:45:06Z",34.676109021529498,-118.455392997711,"11S LU 66667 38089",985.78747599999895]
["C:\\Users\\Fire\\Desktop\\FEMA Inc Converter\\GPX2KMZ Open Converter\\Output\\George_Loffredo20151016.csv",14,"Structure No Damage","2015-10-16T20:46:07Z",34.6762179862707,-118.455087980255,"11S LU 66695 38101",985.47930899999903]
["C:\\Users\\Fire\\Desktop\\FEMA Inc Converter\\GPX2KMZ Open Converter\\Output\\George_Loffredo20151016.csv",141,"Shelter in Place","2015-10-16T20:47:54Z",34.676242964342201,-118.454580958932,"11S LU 66741 38103",985.29925500000002]
["C:\\Users\\Fire\\Desktop\\FEMA Inc Converter\\GPX2KMZ Open Converter\\Output\\George_Loffredo20151016.csv",16,"Structure No Damage","2015-10-16T20:50:52Z",34.676227038726203,-118.453833041712,"11S LU 66810 38100",982.82916299999897]
["C:\\Users\\Fire\\Desktop\\FEMA Inc Converter\\GPX2KMZ Open Converter\\Output\\George_Loffredo20151016.csv",17,"Structure No Damage","2015-10-16T20:51:38Z",34.676215974614003,-118.45388500951201,"11S LU 66805 38099",982.43090800000004]
["C:\\Users\\Fire\\Desktop\\FEMA Inc Converter\\GPX2KMZ Open Converter\\Output\\George_Loffredo20151016.csv",171,"Structure No Damage","2015-10-16T20:53:50Z",34.676441028714102,-118.453623997047,"11S LU 66829 38124",982.62463400000001]
["C:\\Users\\Fire\\Desktop\\FEMA Inc Converter\\GPX2KMZ Open Converter\\Output\\George_Loffredo20151016.csv",18,"Structure No Damage","2015-10-16T20:54:27Z",34.676498025655697,-118.453618967905,"11S LU 66830 38130",983.12506099999905]
["C:\\Users\\Fire\\Desktop\\FEMA Inc Converter\\GPX2KMZ Open Converter\\Output\\George_Loffredo20151016.csv",19,"Shelter in Place","2015-10-16T20:54:58Z",34.676531972363499,-118.45360899344,"11S LU 66831 38134",983.13629200000003]
["C:\\Users\\Fire\\Desktop\\FEMA Inc Converter\\GPX2KMZ Open Converter\\Output\\George_Loffredo20151016.csv",20,"Shelter in Place","2015-10-16T20:57:33Z",34.676585029810603,-118.454693024978,"11S LU 66732 38141",985.40307600000006]
["C:\\Users\\Fire\\Desktop\\FEMA Inc Converter\\GPX2KMZ Open Converter\\Output\\George_Loffredo20151016.csv",21,"Shelter in Place","2015-10-16T20:58:40Z",34.6765680145472,-118.454798972234,"11S LU 66722 38139",985.29956100000004]
["C:\\Users\\Fire\\Desktop\\FEMA Inc Converter\\GPX2KMZ Open Converter\\Output\\George_Loffredo20151016.csv",22,"Shelter in Place","2015-10-16T21:00:40Z",34.676622999831999,-118.455324014648,"11S LU 66674 38146",986.60412599999904]
["C:\\Users\\Fire\\Desktop\\FEMA Inc Converter\\GPX2KMZ Open Converter\\Output\\George_Loffredo20151016.csv",23,"Shelter in Place","2015-10-16T21:01:55Z",34.676670022308798,-118.455016985535,"11S LU 66702 38151",986.41485599999896]
["C:\\Users\\Fire\\Desktop\\FEMA Inc Converter\\GPX2KMZ Open Converter\\Output\\George_Loffredo20151016.csv",25,"Structure No Damage","2015-10-16T21:03:11Z",34.676687037572201,-118.454638961702,"11S LU 66737 38152",986.27142300000003]
["C:\\Users\\Fire\\Desktop\\FEMA Inc Converter\\GPX2KMZ Open Converter\\Output\\George_Loffredo20151016.csv",27,"Shelter in Place","2015-10-16T21:05:04Z",34.676625011488703,-118.453890960663,"11S LU 66805 38144",983.86975099999904]
["C:\\Users\\Fire\\Desktop\\FEMA Inc Converter\\GPX2KMZ Open Converter\\Output\\George_Loffredo20151016.csv",28,"Animal Issue","2015-10-16T21:07:26Z",34.676660969853401,-118.453535987064,"11S LU 66838 38148",983.895081]
["C:\\Users\\Fire\\Desktop\\FEMA Inc Converter\\GPX2KMZ Open Converter\\Output\\George_Loffredo20151016.csv",30,"Structure No Damage","2015-10-16T21:08:47Z",34.676789967343197,-118.453261982649,"11S LU 66863 38162",984.23431400000004]
{"$rows_left_out":15}
{"sheet":"2-Siemen_Loffredo20151016","index":2,"n_rows":139,"n_cols":8,"rows_kept":139,"cut":false,"hidden":false,"merged":[]}
["filename","name","meaning","time","lat","long","usng","elevation"]
["C:\\Users\\Fire\\Desktop\\FEMA Inc Converter\\GPX2KMZ Open Converter\\Output\\Siemen_Loffredo20151016.csv",1,"Route Blocked","MUD PASSIBLE",34.669548003003001,-118.45444902777599,"11S LU 66743 37360",976.23327600000005]
["C:\\Users\\Fire\\Desktop\\FEMA Inc Converter\\GPX2KMZ Open Converter\\Output\\Siemen_Loffredo20151016.csv",2,"Route Blocked","4X4",34.668405968695801,-118.45493601635,"11S LU 66696 37234",974.13745100000006]
["C:\\Users\\Fire\\Desktop\\FEMA Inc Converter\\GPX2KMZ Open Converter\\Output\\Siemen_Loffredo20151016.csv",3,"Route Blocked","2015-10-16T18:04:21Z",34.661890966817701,-118.45815902575799,"11S LU 66390 36516",939.799622]
["C:\\Users\\Fire\\Desktop\\FEMA Inc Converter\\GPX2KMZ Open Converter\\Output\\Siemen_Loffredo20151016.csv",4,"Route Blocked","2015-10-16T18:06:14Z",34.660572996363001,-118.459777990356,"11S LU 66240 36372",938.14306599999895]
["C:\\Users\\Fire\\Desktop\\FEMA Inc Converter\\GPX2KMZ Open Converter\\Output\\Siemen_Loffredo20151016.csv",5,"Animal Issue","HORSE",34.6606529597193,-118.459257977083,"11S LU 66288 36380",931.76763900000003]
["C:\\Users\\Fire\\Desktop\\FEMA Inc Converter\\GPX2KMZ Open Converter\\Output\\Siemen_Loffredo20151016.csv",6,"Animal Issue","HORSES IN STALLS",34.660720014944602,-118.45924699679,"11S LU 66289 36388",931.42950399999904]
["C:\\Users\\Fire\\Desktop\\FEMA Inc Converter\\GPX2KMZ Open Converter\\Output\\Siemen_Loffredo20151016.csv",7,"Animal Issue","HORSE",34.660393036901901,-118.459368031471,"11S LU 66277 36351",930.412598]
["C:\\Users\\Fire\\Desktop\\FEMA Inc Converter\\GPX2KMZ Open Converter\\Output\\Siemen_Loffredo20151016.csv",8,"Animal Issue","HORSE",34.660365041345301,-118.45940097235101,"11S LU 66274 36348",930.44567900000004]
["C:\\Users\\Fire\\Desktop\\FEMA Inc Converter\\GPX2KMZ Open Converter\\Output\\Siemen_Loffredo20151016.csv",9,"Structure No Damage","2015-10-16T18:38:05Z",34.6614759787917,-118.457993986085,"11S LU 66405 36470",925.66485599999896]
["C:\\Users\\Fire\\Desktop\\FEMA Inc Converter\\GPX2KMZ Open Converter\\Output\\Siemen_Loffredo20151016.csv",10,"Structure No Damage","TUFF SHED",34.661098038777702,-118.457533987239,"11S LU 66446 36427",924.52710000000002]
["C:\\Users\\Fire\\Desktop\\FEMA Inc Converter\\GPX2KMZ Open Converter\\Output\\Siemen_Loffredo20151016.csv",11,"Animal Issue","2015-10-16T18:41:37Z",34.661188982427099,-118.45750096254,"11S LU 66450 36437",924.70153800000003]
["C:\\Users\\Fire\\Desktop\\FEMA Inc Converter\\GPX2KMZ Open Converter\\Output\\Siemen_Loffredo20151016.csv",12,"Animal Issue","2015-10-16T18:41:48Z",34.661187976598697,-118.457468021661,"11S LU 66453 36437",924.69219999999905]
["C:\\Users\\Fire\\Desktop\\FEMA Inc Converter\\GPX2KMZ Open Converter\\Output\\Siemen_Loffredo20151016.csv",13,"Animal Issue","2015-10-16T18:42:01Z",34.661187976598697,-118.457327038049,"11S LU 66466 36437",924.77459699999895]
["C:\\Users\\Fire\\Desktop\\FEMA Inc Converter\\GPX2KMZ Open Converter\\Output\\Siemen_Loffredo20151016.csv",14,"Animal Issue","2015-10-16T18:42:09Z",34.661199040710898,-118.457245985046,"11S LU 66473 36438",924.81591800000001]
["C:\\Users\\Fire\\Desktop\\FEMA Inc Converter\\GPX2KMZ Open Converter\\Output\\Siemen_Loffredo20151016.csv",15,"Animal Issue","2015-10-16T18:42:11Z",34.661200968548599,-118.457241039723,"11S LU 66473 36438",924.8125]
["C:\\Users\\Fire\\Desktop\\FEMA Inc Converter\\GPX2KMZ Open Converter\\Output\\Siemen_Loffredo20151016.csv",16,"Animal Issue","2015-10-16T18:42:21Z",34.661222007125602,-118.45716199837599,"11S LU 66481 36440",926.34631300000001]
["C:\\Users\\Fire\\Desktop\\FEMA Inc Converter\\GPX2KMZ Open Converter\\Output\\Siemen_Loffredo20151016.csv",17,"Animal Issue","2015-10-16T18:42:33Z",34.661265006288801,-118.457079017534,"11S LU 66488 36445",924.89379899999904]
["C:\\Users\\Fire\\Desktop\\FEMA Inc Converter\\GPX2KMZ Open Converter\\Output\\Siemen_Loffredo20151016.csv",18,"Animal Issue","2015-10-16T18:42:35Z",34.661275986581998,-118.457066025584,"11S LU 66490 36446",924.89086899999904]
["C:\\Users\\Fire\\Desktop\\FEMA Inc Converter\\GPX2KMZ Open Converter\\Output\\Siemen_Loffredo20151016.csv",19,"Animal Issue","2015-10-16T18:42:47Z",34.661330971866803,-118.456958988681,"11S LU 66500 36452",925.72680700000001]
["C:\\Users\\Fire\\Desktop\\FEMA Inc Converter\\GPX2KMZ Open Converter\\Output\\Siemen_Loffredo20151016.csv",20,"Animal Issue","2015-10-16T18:42:58Z",34.661366008222103,-118.456829991191,"11S LU 66511 36456",925.48150599999894]
["C:\\Users\\Fire\\Desktop\\FEMA Inc Converter\\GPX2KMZ Open Converter\\Output\\Siemen_Loffredo20151016.csv",21,"Route Blocked","TREE X DRIVEWAY",34.661320997402001,-118.45665003173001,"11S LU 66528 36451",930.956726]
["C:\\Users\\Fire\\Desktop\\FEMA Inc Converter\\GPX2KMZ Open Converter\\Output\\Siemen_Loffredo20151016.csv",22,"Structure No Damage","2015-10-16T18:46:34Z",34.661645963787997,-118.455984005704,"11S LU 66589 36486",938.696594]
["C:\\Users\\Fire\\Desktop\\FEMA Inc Converter\\GPX2KMZ Open Converter\\Output\\Siemen_Loffredo20151016.csv",23,"Structure No Damage","2015-10-16T18:49:18Z",34.662738963961601,-118.45546700991601,"11S LU 66638 36606",930.86566200000004]
["C:\\Users\\Fire\\Desktop\\FEMA Inc Converter\\GPX2KMZ Open Converter\\Output\\Siemen_Loffredo20151016.csv",24,"Structure No Damage","2015-10-16T18:51:43Z",34.6627819631248,-118.455400960519,"11S LU 66645 36611",930.28137200000003]
["C:\\Users\\Fire\\Desktop\\FEMA Inc Converter\\GPX2KMZ Open Converter\\Output\\Siemen_Loffredo20151016.csv",25,"Structure No Damage","2015-10-16T18:52:20Z",34.662801995873401,-118.455438008531,"11S LU 66641 36613",930.16747999999905]
["C:\\Users\\Fire\\Desktop\\FEMA Inc Converter\\GPX2KMZ Open Converter\\Output\\Siemen_Loffredo20151016.csv",26,"Structure No Damage","2015-10-16T18:52:21Z",34.662801995873401,-118.455438008531,"11S LU 66641 36613",930.165344]
["C:\\Users\\Fire\\Desktop\\FEMA Inc Converter\\GPX2KMZ Open Converter\\Output\\Siemen_Loffredo20151016.csv",27,"Structure No Damage","2015-10-16T18:52:22Z",34.662801995873401,-118.455438008531,"11S LU 66641 36613",930.16320800000005]
["C:\\Users\\Fire\\Desktop\\FEMA Inc Converter\\GPX2KMZ Open Converter\\Output\\Siemen_Loffredo20151016.csv",28,"Structure No Damage","2015-10-16T18:52:34Z",34.6627979725599,-118.45542702823801,"11S LU 66642 36613",929.98931900000002]
["C:\\Users\\Fire\\Desktop\\FEMA Inc Converter\\GPX2KMZ Open Converter\\Output\\Siemen_Loffredo20151016.csv",29,"Structure No Damage","GARAGE",34.6628449950367,-118.455343963578,"11S LU 66650 36618",929.74816899999905]
{"$rows_left_out":110}
{"sheet":"3-Strine_Bartram20151016","index":3,"n_rows":38,"n_cols":8,"rows_kept":38,"cut":false,"hidden":false,"merged":[]}
["filename","name","meaning","time","lat","long","usng","elevation"]
["C:\\Users\\Fire\\Desktop\\FEMA Inc Converter\\GPX2KMZ Open Converter\\Output\\Strine_Bartram20151016.csv",1,"Structure No Damage","2015-10-16T20:12:16Z",34.612473025918,-118.28438800759599,"11S LU 82244 30819",948.61444100000006]
["C:\\Users\\Fire\\Desktop\\FEMA Inc Converter\\GPX2KMZ Open Converter\\Output\\Strine_Bartram20151016.csv",2,"Structure No Damage",22,34.6119990292936,-118.284405022859,"11S LU 82242 30766",951.08905000000004]
["C:\\Users\\Fire\\Desktop\\FEMA Inc Converter\\GPX2KMZ Open Converter\\Output\\Strine_Bartram20151016.csv",3,"Structure No Damage",4,34.611612958833497,-118.284393036738,"11S LU 82242 30723",952.81115699999896]
["C:\\Users\\Fire\\Desktop\\FEMA Inc Converter\\GPX2KMZ Open Converter\\Output\\Strine_Bartram20151016.csv",4,"Structure No Damage",4,34.611222026869598,-118.284392030909,"11S LU 82242 30680",954.34240699999896]
["C:\\Users\\Fire\\Desktop\\FEMA Inc Converter\\GPX2KMZ Open Converter\\Output\\Strine_Bartram20151016.csv",5,"Structure No Damage",2,34.610082004219201,-118.284376021474,"11S LU 82242 30554",960.52673300000004]
["C:\\Users\\Fire\\Desktop\\FEMA Inc Converter\\GPX2KMZ Open Converter\\Output\\Strine_Bartram20151016.csv",6,"Structure No Damage",2,34.609145997092099,-118.284374009817,"11S LU 82241 30450",965.84423800000002]
["C:\\Users\\Fire\\Desktop\\FEMA Inc Converter\\GPX2KMZ Open Converter\\Output\\Strine_Bartram20151016.csv",7,"Structure No Damage","2015-10-16T20:15:34Z",34.6085659693926,-118.284358000382,"11S LU 82241 30386",967.22589100000005]
["C:\\Users\\Fire\\Desktop\\FEMA Inc Converter\\GPX2KMZ Open Converter\\Output\\Strine_Bartram20151016.csv",8,"Structure No Damage",3,34.607556033879497,-118.28433997929,"11S LU 82242 30274",970.12927200000001]
["C:\\Users\\Fire\\Desktop\\FEMA Inc Converter\\GPX2KMZ Open Converter\\Output\\Strine_Bartram20151016.csv",9,"Structure No Damage",4,34.6064000017941,-118.284190027043,"11S LU 82254 30145",976.31878700000004]
["C:\\Users\\Fire\\Desktop\\FEMA Inc Converter\\GPX2KMZ Open Converter\\Output\\Strine_Bartram20151016.csv",10,"Structure No Damage",2,34.605688964948001,-118.283763974905,"11S LU 82292 30066",981.04834000000005]
["C:\\Users\\Fire\\Desktop\\FEMA Inc Converter\\GPX2KMZ Open Converter\\Output\\Strine_Bartram20151016.csv",11,"Structure No Damage","2015-10-16T20:23:44Z",34.603233989328103,-118.282711962237,"11S LU 82385 29792",991.43975799999896]
["C:\\Users\\Fire\\Desktop\\FEMA Inc Converter\\GPX2KMZ Open Converter\\Output\\Strine_Bartram20151016.csv",12,"Structure No Damage","39733  87TH  MUD IN HOME",34.605100974440496,-118.28338704071901,"11S LU 82325 30000",982.30999799999904]
["C:\\Users\\Fire\\Desktop\\FEMA Inc Converter\\GPX2KMZ Open Converter\\Output\\Strine_Bartram20151016.csv",13,"Structure No Damage","VACANT WATER DAMAGE",34.606867963448103,-118.284327993169,"11S LU 82242 30197",976.10998500000005]
["C:\\Users\\Fire\\Desktop\\FEMA Inc Converter\\GPX2KMZ Open Converter\\Output\\Strine_Bartram20151016.csv",14,"Structure No Damage","2015-10-16T20:47:44Z",34.615078037604597,-118.260761015117,"11S LU 84414 31080",1005.657288]
["C:\\Users\\Fire\\Desktop\\FEMA Inc Converter\\GPX2KMZ Open Converter\\Output\\Strine_Bartram20151016.csv",15,"Structure No Damage","2015-10-16T20:48:01Z",34.614920038729899,-118.26116502284999,"11S LU 84377 31063",1001.9472050000001]
["C:\\Users\\Fire\\Desktop\\FEMA Inc Converter\\GPX2KMZ Open Converter\\Output\\Strine_Bartram20151016.csv",16,"Structure No Damage","2015-10-16T20:48:19Z",34.614856000989597,-118.26229297555901,"11S LU 84273 31058",992.39324999999894]
["C:\\Users\\Fire\\Desktop\\FEMA Inc Converter\\GPX2KMZ Open Converter\\Output\\Strine_Bartram20151016.csv",17,"Structure No Damage","2015-10-16T20:49:15Z",34.611278017982798,-118.26233798637899,"11S LU 84264 30661",958.30670199999895]
["C:\\Users\\Fire\\Desktop\\FEMA Inc Converter\\GPX2KMZ Open Converter\\Output\\Strine_Bartram20151016.csv",18,"Structure No Damage","2015-10-16T20:49:16Z",34.611212974414201,-118.26234402135,"11S LU 84263 30654",958.33349599999895]
["C:\\Users\\Fire\\Desktop\\FEMA Inc Converter\\GPX2KMZ Open Converter\\Output\\Strine_Bartram20151016.csv",19,"Structure No Damage",2,34.609507005661698,-118.261030996218,"11S LU 84382 30463",940.92663600000003]
["C:\\Users\\Fire\\Desktop\\FEMA Inc Converter\\GPX2KMZ Open Converter\\Output\\Strine_Bartram20151016.csv",20,"Structure No Damage","2015-10-16T20:50:49Z",34.6097319759428,-118.260184004902,"11S LU 84459 30487",947.41693099999895]
["C:\\Users\\Fire\\Desktop\\FEMA Inc Converter\\GPX2KMZ Open Converter\\Output\\Strine_Bartram20151016.csv",21,"Structure No Damage","2015-10-16T20:52:16Z",34.612179994583101,-118.260213006287,"11S LU 84460 30758",974.08905000000004]
["C:\\Users\\Fire\\Desktop\\FEMA Inc Converter\\GPX2KMZ Open Converter\\Output\\Strine_Bartram20151016.csv",22,"Structure No Damage","2015-10-16T20:52:18Z",34.612189969047897,-118.260285006836,"11S LU 84454 30760",973.85070800000005]
["C:\\Users\\Fire\\Desktop\\FEMA Inc Converter\\GPX2KMZ Open Converter\\Output\\Strine_Bartram20151016.csv",23,"Structure No Damage","2015-10-16T20:53:33Z",34.612179994583101,-118.26076503842999,"11S LU 84410 30759",972.14855999999895]
["C:\\Users\\Fire\\Desktop\\FEMA Inc Converter\\GPX2KMZ Open Converter\\Output\\Strine_Bartram20151016.csv",24,"Structure No Damage","7650  DAMAGE WATER MUD",34.610233968123701,-118.26675298623699,"11S LU 83858 30550",939.49224900000002]
["C:\\Users\\Fire\\Desktop\\FEMA Inc Converter\\GPX2KMZ Open Converter\\Output\\Strine_Bartram20151016.csv",25,"Structure No Damage","2015-10-16T21:00:11Z",34.6115340013056,-118.27022602781599,"11S LU 83541 30698",943.93981900000006]
["C:\\Users\\Fire\\Desktop\\FEMA Inc Converter\\GPX2KMZ Open Converter\\Output\\Strine_Bartram20151016.csv",26,"Structure No Damage",3,34.6141370013356,-118.27730496414,"11S LU 82896 30995",943.122253]
["C:\\Users\\Fire\\Desktop\\FEMA Inc Converter\\GPX2KMZ Open Converter\\Output\\Strine_Bartram20151016.csv",27,"Structure No Damage","2015-10-16T21:02:25Z",34.6149219665676,-118.279745019972,"11S LU 82673 31085",947.56457499999897]
["C:\\Users\\Fire\\Desktop\\FEMA Inc Converter\\GPX2KMZ Open Converter\\Output\\Strine_Bartram20151016.csv",28,"Structure No Damage",4,34.615179961547199,-118.280565021559,"11S LU 82598 31115",948.698669]
["C:\\Users\\Fire\\Desktop\\FEMA Inc Converter\\GPX2KMZ Open Converter\\Output\\Strine_Bartram20151016.csv",29,"Structure No Damage",4,34.615952018648301,-118.282741969451,"11S LU 82400 31203",951.51245100000006]
{"$rows_left_out":8}