{"text_format":"1","workbook":"xlsx","n_sheets":12,"sheets":["1. Report.MAFFS.by.Incident","2. Report.Summary.All","3. MAFFS Military Costs","4. Total Cost","5. Federal Personnel","6. Misc Support Costs","7. DATA","8. AEG Costs","Mailing.list","Changes","Instructions","lookup"],"not_rendered":{"charts":0,"images":1,"macros":1,"external_links":0,"defined_names":7,"comments":5,"pivot_tables":2},"unopened":[],"bounds":{"document_bytes":16777216,"sheet_cells":100000,"rows_first":2000,"rows_last":500,"rows_between":2000,"halvings":0,"cell_chars":16384,"cell_head_chars":4096},"cells_cut":0,"cells_raw":0,"read":"whole","date_system":"1900"}

{"sheet":"1. Report.MAFFS.by.Incident","index":0,"n_rows":16,"n_cols":8,"rows_kept":16,"cut":false,"hidden":false,"merged":[[9,3,9,6],[7,3,7,6],[6,3,6,6],[5,3,5,6],[8,3,8,6]]}
[]
[]
["Set to current date and refresh before transmitting."]
["If you want to see a display for a specific dates select those dates"]
[null,null,null," "]
[null,null,null," "]
[null,null,null," "]
["Year","(blank)"]
["Month","(blank)",null,"Click to select a Month"]
["Day","(blank)",null,"Click to select a Day"]
{"$rows_left_out":7}
{"sheet":"2. Report.Summary.All","index":1,"n_rows":7,"n_cols":13,"rows_kept":7,"cut":false,"hidden":false,"merged":[[4,3,4,5]]}
[]
[]
[]
[null,null,null," "]
[null,null,null,"Resource Order "]
["Fire Name","Base Location","P-Code","MAFFS #","State","Unit Identifier","Order No.","Month","Day","Sorties","Retardant\nGallons","Retardant Cost","Flight\nHours"]
["Grand Total"]

{"sheet":"3. MAFFS Military Costs","index":2,"n_rows":55,"n_cols":16,"rows_kept":55,"cut":false,"hidden":false,"merged":[]}
[null,null,null,null,"MAFFS Military Costs at",null,null,{"$f":"Mailing.list!C19","v":"Greeneville, SC"}]
[]
["Date","USAFR Personnel Present","ANG Personnel Present","USAFR Military Personnel Cost","ANG  Military Personnel Cost ","A/C RON","USAFR Support A.C. Hours","ANG  Support A.C. Hours"," USAFR Mission A.C. Hours"," ANG Mission A.C. Hours","USAFR Support AC Cost","ANG Support AC Cost","USAFR Misson AC Cost","ANG Misson AC Cost","Total Aircraft Cost","Total Daily Military Cost"]
[null,null,null,{"$f":"SUM((B4)*500)","v":0},{"$f":"SUM(C4*500)","v":0},null,{"$f":"SUM(IF(('7. DATA'!$I$2:$I$24='3. MAFFS Military Costs'!$A4)*('7. DATA'!$D$2:$D$24=\"Support\")*('7. DATA'!$E$2:$E$24=\"A\"),'7. DATA'!$Q$2:$Q$24,0))","v":0},{"$f":"SUM(IF(('7. DATA'!$I$2:$I$24='3. MAFFS Military Costs'!$A4)*('7. DATA'!$D$2:$D$24=\"Support\")*('7. DATA'!$E$2:$E$24=\"N\"),'7. DATA'!$Q$2:$Q$24,0))","v":0},{"$f":"SUM(IF(('7. DATA'!$I$2:$I$24='3. MAFFS Military Costs'!$A4)*('7. DATA'!$D$2:$D$24<>\"Support\")*('7. DATA'!$E$2:$E$24=\"A\"),'7. DATA'!$Q$2:$Q$24,0))","v":0},{"$f":"SUM(IF(('7. DATA'!$I$2:$I$24='3. MAFFS Military Costs'!$A4)*('7. DATA'!$D$2:$D$24<>\"Support\")*('7. DATA'!$E$2:$E$24=\"N\"),'7. DATA'!$Q$2:$Q$24,0))","v":0},{"$f":"G4*6964","v":0},{"$f":"H4*6964","v":0},{"$f":"I4*6964","v":0},{"$f":"J4*6964","v":0},{"$f":"SUM(K4:N4)","v":0},{"$f":"+D4+E4+O4","v":0}]
[{"$f":"+A4+1","v":"1900-01-01"},null,null,{"$f":"SUM((B5)*500)","v":0},{"$f":"SUM(C5*500)","v":0},null,{"$f":"SUM(IF(('7. DATA'!$I$2:$I$24='3. MAFFS Military Costs'!$A5)*('7. DATA'!$D$2:$D$24=\"Support\")*('7. DATA'!$E$2:$E$24=\"A\"),'7. DATA'!$Q$2:$Q$24,0))","v":0},{"$f":"SUM(IF(('7. DATA'!$I$2:$I$24='3. MAFFS Military Costs'!$A5)*('7. DATA'!$D$2:$D$24=\"Support\")*('7. DATA'!$E$2:$E$24=\"N\"),'7. DATA'!$Q$2:$Q$24,0))","v":0},{"$f":"SUM(IF(('7. DATA'!$I$2:$I$24='3. MAFFS Military Costs'!$A5)*('7. DATA'!$D$2:$D$24<>\"Support\")*('7. DATA'!$E$2:$E$24=\"A\"),'7. DATA'!$Q$2:$Q$24,0))","v":0},{"$f":"SUM(IF(('7. DATA'!$I$2:$I$24='3. MAFFS Military Costs'!$A5)*('7. DATA'!$D$2:$D$24<>\"Support\")*('7. DATA'!$E$2:$E$24=\"N\"),'7. DATA'!$Q$2:$Q$24,0))","v":0},{"$f":"G5*6964","v":0},{"$f":"H5*6964","v":0},{"$f":"I5*6964","v":0},{"$f":"J5*6964","v":0},0,0]
[{"$f":"+A5+1","v":"1900-01-02"},null,null,0,0,null,{"$f":"SUM(IF(('7. DATA'!$I$2:$I$24='3. MAFFS Military Costs'!$A6)*('7. DATA'!$D$2:$D$24=\"Support\")*('7. DATA'!$E$2:$E$24=\"A\"),'7. DATA'!$Q$2:$Q$24,0))","v":0},{"$f":"SUM(IF(('7. DATA'!$I$2:$I$24='3. MAFFS Military Costs'!$A6)*('7. DATA'!$D$2:$D$24=\"Support\")*('7. DATA'!$E$2:$E$24=\"N\"),'7. DATA'!$Q$2:$Q$24,0))","v":0},{"$f":"SUM(IF(('7. DATA'!$I$2:$I$24='3. MAFFS Military Costs'!$A6)*('7. DATA'!$D$2:$D$24<>\"Support\")*('7. DATA'!$E$2:$E$24=\"A\"),'7. DATA'!$Q$2:$Q$24,0))","v":0},{"$f":"SUM(IF(('7. DATA'!$I$2:$I$24='3. MAFFS Military Costs'!$A6)*('7. DATA'!$D$2:$D$24<>\"Support\")*('7. DATA'!$E$2:$E$24=\"N\"),'7. DATA'!$Q$2:$Q$24,0))","v":0},0,0,0,0,0,0]
["1900-01-03",null,null,0,0,null,{"$f":"SUM(IF(('7. DATA'!$I$2:$I$24='3. MAFFS Military Costs'!$A7)*('7. DATA'!$D$2:$D$24=\"Support\")*('7. DATA'!$E$2:$E$24=\"A\"),'7. DATA'!$Q$2:$Q$24,0))","v":0},{"$f":"SUM(IF(('7. DATA'!$I$2:$I$24='3. MAFFS Military Costs'!$A7)*('7. DATA'!$D$2:$D$24=\"Support\")*('7. DATA'!$E$2:$E$24=\"N\"),'7. DATA'!$Q$2:$Q$24,0))","v":0},{"$f":"SUM(IF(('7. DATA'!$I$2:$I$24='3. MAFFS Military Costs'!$A7)*('7. DATA'!$D$2:$D$24<>\"Support\")*('7. DATA'!$E$2:$E$24=\"A\"),'7. DATA'!$Q$2:$Q$24,0))","v":0},{"$f":"SUM(IF(('7. DATA'!$I$2:$I$24='3. MAFFS Military Costs'!$A7)*('7. DATA'!$D$2:$D$24<>\"Support\")*('7. DATA'!$E$2:$E$24=\"N\"),'7. DATA'!$Q$2:$Q$24,0))","v":0},0,0,0,0,0,0]
["1900-01-04",null,null,0,0,null,{"$f":"SUM(IF(('7. DATA'!$I$2:$I$24='3. MAFFS Military Costs'!$A8)*('7. DATA'!$D$2:$D$24=\"Support\")*('7. DATA'!$E$2:$E$24=\"A\"),'7. DATA'!$Q$2:$Q$24,0))","v":0},{"$f":"SUM(IF(('7. DATA'!$I$2:$I$24='3. MAFFS Military Costs'!$A8)*('7. DATA'!$D$2:$D$24=\"Support\")*('7. DATA'!$E$2:$E$24=\"N\"),'7. DATA'!$Q$2:$Q$24,0))","v":0},{"$f":"SUM(IF(('7. DATA'!$I$2:$I$24='3. MAFFS Military Costs'!$A8)*('7. DATA'!$D$2:$D$24<>\"Support\")*('7. DATA'!$E$2:$E$24=\"A\"),'7. DATA'!$Q$2:$Q$24,0))","v":0},{"$f":"SUM(IF(('7. DATA'!$I$2:$I$24='3. MAFFS Military Costs'!$A8)*('7. DATA'!$D$2:$D$24<>\"Support\")*('7. DATA'!$E$2:$E$24=\"N\"),'7. DATA'!$Q$2:$Q$24,0))","v":0},0,0,0,0,0,0]
["1900-01-05",null,null,0,0,null,{"$f":"SUM(IF(('7. DATA'!$I$2:$I$24='3. MAFFS Military Costs'!$A9)*('7. DATA'!$D$2:$D$24=\"Support\")*('7. DATA'!$E$2:$E$24=\"A\"),'7. DATA'!$Q$2:$Q$24,0))","v":0},{"$f":"SUM(IF(('7. DATA'!$I$2:$I$24='3. MAFFS Military Costs'!$A9)*('7. DATA'!$D$2:$D$24=\"Support\")*('7. DATA'!$E$2:$E$24=\"N\"),'7. DATA'!$Q$2:$Q$24,0))","v":0},{"$f":"SUM(IF(('7. DATA'!$I$2:$I$24='3. MAFFS Military Costs'!$A9)*('7. DATA'!$D$2:$D$24<>\"Support\")*('7. DATA'!$E$2:$E$24=\"A\"),'7. DATA'!$Q$2:$Q$24,0))","v":0},{"$f":"SUM(IF(('7. DATA'!$I$2:$I$24='3. MAFFS Military Costs'!$A9)*('7. DATA'!$D$2:$D$24<>\"Support\")*('7. DATA'!$E$2:$E$24=\"N\"),'7. DATA'!$Q$2:$Q$24,0))","v":0},0,0,0,0,0,0]
["1900-01-06",null,null,0,0,null,{"$f":"SUM(IF(('7. DATA'!$I$2:$I$24='3. MAFFS Military Costs'!$A10)*('7. DATA'!$D$2:$D$24=\"Support\")*('7. DATA'!$E$2:$E$24=\"A\"),'7. DATA'!$Q$2:$Q$24,0))","v":0},{"$f":"SUM(IF(('7. DATA'!$I$2:$I$24='3. MAFFS Military Costs'!$A10)*('7. DATA'!$D$2:$D$24=\"Support\")*('7. DATA'!$E$2:$E$24=\"N\"),'7. DATA'!$Q$2:$Q$24,0))","v":0},{"$f":"SUM(IF(('7. DATA'!$I$2:$I$24='3. MAFFS Military Costs'!$A10)*('7. DATA'!$D$2:$D$24<>\"Support\")*('7. DATA'!$E$2:$E$24=\"A\"),'7. DATA'!$Q$2:$Q$24,0))","v":0},{"$f":"SUM(IF(('7. DATA'!$I$2:$I$24='3. MAFFS Military Costs'!$A10)*('7. DATA'!$D$2:$D$24<>\"Support\")*('7. DATA'!$E$2:$E$24=\"N\"),'7. DATA'!$Q$2:$Q$24,0))","v":0},0,0,0,0,0,0]
{"$rows_left_out":46}
{"sheet":"4. Total Cost","index":3,"n_rows":12,"n_cols":5,"rows_kept":12,"cut":false,"hidden":false,"merged":[]}
[]
["Summary of Costs "]
[" "]
["Retardant Costs",null,null,null,{"$f":"SUM('7. DATA'!P27)","v":0}]
["Misc. Support Costs",null,null,null,{"$f":"'6. Misc Support Costs'!I23","v":4775}]
["Military Costs",null,null,null,{"$f":"SUM('3. MAFFS Military Costs'!P24)+SUM('8. AEG Costs'!C18)","v":40400}]
["Federal Personnel",null,null,null,{"$f":"SUM('5. Federal Personnel'!AH24)","v":65510}]
["Grand Total",null,null,null,{"$f":"SUM(E4:E7)","v":110685}]
[]
[]
{"$rows_left_out":3}
{"sheet":"5. Federal Personnel","index":4,"n_rows":24,"n_cols":35,"rows_kept":24,"cut":false,"hidden":false,"merged":[[5,29,5,30],[5,31,5,32],[5,1,5,2],[5,3,5,4],[5,5,5,6],[5,7,5,8],[5,9,5,10],[5,13,5,14],[5,15,5,16],[5,17,5,18],[5,11,5,12],[5,27,5,28],[5,19,5,20],[5,21,5,22],[5,23,5,24],[5,25,5,26]]}
["Agency Personnel Costs per Day at ",null,null,null,null,null,{"$f":"Mailing.list!C19","v":"Greeneville, SC"}]
["Personnel, Includes estimated OT, Travel & per diem"]
["Only include personnel assigned to the activation….have a resource order number (\"O number\")"]
[]
[]
[null,"MLO",null,"AMLO",null,"AMLO-T",null,"MABM",null,"MABS",null,"MABS-T",null,"Procurement",null,"MAFFS Clerk",null,"Ground Support",null,"MAFFS Mechanic",null,"Avionics Tech",null,"Safety Officer",null,"Information Officer",null,"Base Camp Mgr",null,"Security",null,"Camp Crew",null,"Cost Total","Personnel"]
["Date","# Assigned","Cost","# Assigned","Cost","# Assigned","Cost","# assigned","Cost","# Assigned","Cost","# Assigned","Cost","# Assigned","Cost","# Assigned","Cost","# Assigned","Cost","# Assigned","Cost","# Assigned","Cost","# Assigned","Cost","# Assigned","Cost","# Assigned","Cost","# Assigned","Cost","# Assigned","Cost","TOTAL"]
["2012-05-03",1,{"$f":"SUM(lookup!$B$3)*'5. Federal Personnel'!B8","v":600},null,{"$f":"SUM(lookup!$B$4)*'5. Federal Personnel'!D8","v":0},null,{"$f":"SUM(lookup!$B$5)*'5. Federal Personnel'!F8","v":0},1,{"$f":"SUM(lookup!$B$6)*'5. Federal Personnel'!H8","v":440},null,{"$f":"SUM(lookup!$B$7)*'5. Federal Personnel'!J8","v":0},null,{"$f":"SUM(lookup!$B$7)*'5. Federal Personnel'!L8","v":0},1,{"$f":"SUM(lookup!$B$8)*'5. Federal Personnel'!N8","v":440},3,{"$f":"SUM(lookup!$B$9)*'5. Federal Personnel'!P8","v":1200},4,{"$f":"SUM(lookup!$B$10)*'5. Federal Personnel'!R8","v":1400},null,{"$f":"SUM(lookup!$B$11)*'5. Federal Personnel'!T8","v":0},1,{"$f":"SUM(lookup!$B$12)*'5. Federal Personnel'!V8","v":500},1,{"$f":"SUM(lookup!$B$13)*'5. Federal Personnel'!X8","v":400},1,{"$f":"SUM(lookup!$B$14)*'5. Federal Personnel'!Z8","v":400},1,{"$f":"SUM(lookup!$B$15)*'5. Federal Personnel'!AB8","v":400},3,{"$f":"SUM(lookup!$B$16)*'5. Federal Personnel'!AD8","v":1500},null,{"$f":"SUM(lookup!$B$17)*'5. Federal Personnel'!AF8","v":0},{"$f":"SUM(C8+E8+G8+I8+K8+M8+O8+Q8+S8+U8+W8+Y8+AA8+AC8+AE8+AG8)","v":7280},{"$f":"SUM(B8,D8,F8,H8,J8,L8,N8,P8,R8,T8,V8,X8,Z8,AB8,AD8,AF8)","v":17}]
[{"$f":"A8+1","v":"2012-05-04"},1,{"$f":"SUM(lookup!$B$3)*'5. Federal Personnel'!B9","v":600},null,{"$f":"SUM(lookup!$B$4)*'5. Federal Personnel'!D9","v":0},null,{"$f":"SUM(lookup!$B$5)*'5. Federal Personnel'!F9","v":0},1,{"$f":"SUM(lookup!$B$6)*'5. Federal Personnel'!H9","v":440},null,{"$f":"SUM(lookup!$B$7)*'5. Federal Personnel'!J9","v":0},null,{"$f":"SUM(lookup!$B$7)*'5. Federal Personnel'!L9","v":0},1,{"$f":"SUM(lookup!$B$8)*'5. Federal Personnel'!N9","v":440},3,{"$f":"SUM(lookup!$B$9)*'5. Federal Personnel'!P9","v":1200},4,{"$f":"SUM(lookup!$B$10)*'5. Federal Personnel'!R9","v":1400},null,{"$f":"SUM(lookup!$B$11)*'5. Federal Personnel'!T9","v":0},2,{"$f":"SUM(lookup!$B$12)*'5. Federal Personnel'!V9","v":1000},1,{"$f":"SUM(lookup!$B$13)*'5. Federal Personnel'!X9","v":400},1,{"$f":"SUM(lookup!$B$14)*'5. Federal Personnel'!Z9","v":400},1,{"$f":"SUM(lookup!$B$15)*'5. Federal Personnel'!AB9","v":400},3,{"$f":"SUM(lookup!$B$16)*'5. Federal Personnel'!AD9","v":1500},null,{"$f":"SUM(lookup!$B$17)*'5. Federal Personnel'!AF9","v":0},{"$f":"SUM(C9+E9+G9+I9+K9+M9+O9+Q9+S9+U9+W9+Y9+AA9+AC9+AE9+AG9)","v":7780},{"$f":"SUM(B9,D9,F9,H9,J9,L9,N9,P9,R9,T9,V9,X9,Z9,AB9,AD9,AF9)","v":18}]
[{"$f":"A9+1","v":"2012-05-05"},1,{"$f":"SUM(lookup!$B$3)*'5. Federal Personnel'!B10","v":600},null,{"$f":"SUM(lookup!$B$4)*'5. Federal Personnel'!D10","v":0},null,{"$f":"SUM(lookup!$B$5)*'5. Federal Personnel'!F10","v":0},2,{"$f":"SUM(lookup!$B$6)*'5. Federal Personnel'!H10","v":880},1,{"$f":"SUM(lookup!$B$7)*'5. Federal Personnel'!J10","v":440},null,{"$f":"SUM(lookup!$B$7)*'5. Federal Personnel'!L10","v":0},2,{"$f":"SUM(lookup!$B$8)*'5. Federal Personnel'!N10","v":880},3,{"$f":"SUM(lookup!$B$9)*'5. Federal Personnel'!P10","v":1200},4,{"$f":"SUM(lookup!$B$10)*'5. Federal Personnel'!R10","v":1400},3,{"$f":"SUM(lookup!$B$11)*'5. Federal Personnel'!T10","v":2700},2,{"$f":"SUM(lookup!$B$12)*'5. Federal Personnel'!V10","v":1000},1,{"$f":"SUM(lookup!$B$13)*'5. Federal Personnel'!X10","v":400},1,{"$f":"SUM(lookup!$B$14)*'5. Federal Personnel'!Z10","v":400},1,{"$f":"SUM(lookup!$B$15)*'5. Federal Personnel'!AB10","v":400},3,{"$f":"SUM(lookup!$B$16)*'5. Federal Personnel'!AD10","v":1500},null,{"$f":"SUM(lookup!$B$17)*'5. Federal Personnel'!AF10","v":0},{"$f":"SUM(C10+E10+G10+I10+K10+M10+O10+Q10+S10+U10+W10+Y10+AA10+AC10+AE10+AG10)","v":11800},{"$f":"SUM(B10,D10,F10,H10,J10,L10,N10,P10,R10,T10,V10,X10,Z10,AB10,AD10,AF10)","v":24}]
{"$rows_left_out":15}
{"sheet":"6. Misc Support Costs","index":5,"n_rows":38,"n_cols":9,"rows_kept":38,"cut":false,"hidden":false,"merged":[]}
[null,"      MAFFS Equipment & Supply Expenses at ",null,null,null,null,{"$f":"Mailing.list!C19","v":"Greeneville, SC"}]
[]
[null,null,"Date","Transportation","Lodging","Supplies","Services/ Equipment","Airport Fees","Cost"]
[null,null,"2012-05-03",null,null,4775,null,null,{"$f":"SUM(D4:H4)","v":4775}]
[null,null,{"$f":"C4+1","v":"2012-05-04"},null,null,null,null,null,0]
[null,null,{"$f":"C5+1","v":"2012-05-05"},null,null,null,null,null,0]
[null,null,"2012-05-06",null,null,null,null,null,0]
[null,null,"2012-05-07",null,null,null,null,null,0]
[null,null,"2012-05-08",null,null,null,null,null,0]
[null,null,"2012-05-09",null,null,null,null,null,0]
{"$rows_left_out":29}
{"sheet":"7. DATA","index":6,"n_rows":27,"n_cols":18,"rows_kept":27,"cut":false,"hidden":false,"merged":[]}
["Base Location","Fire Name","P-Code","MAFFS\nUNIT #\nor\nSupport","A=AF\nN=NG\n\n","Month","Day","Year","Date (NO ENTRY REQ'D)","State Name","Unit Identifier","Order Number","Flights","Retardant\nGallons","Retardant/Gallon Cost","Retardant Cost","Flight\nHours","Comments (not visible on any other tabs)"]
[]
[]
[]
[]
[]
[]
[]
[]
[]
{"$rows_left_out":18}
{"sheet":"8. AEG Costs","index":7,"n_rows":18,"n_cols":17,"rows_kept":18,"cut":false,"hidden":false,"merged":[]}
[]
[]
["Note:  Standard AEG Costs are one officer and one enlisted (Title 32). Large activations will require additional military personnel assigned. Costs embedded include all travel and per diem"]
["Date","#","Standard                      AEG Commander","#","Standard                       AEG Support (Enlisted)","#","Additional","#","Additional","#","Additional","#","Additional","#","Additional","#","Additional"]
[null,4,{"$f":"SUM(lookup!$B$21)*B5","v":2400},3,{"$f":"SUM(lookup!$B$22)*D5","v":1200},null,{"$f":"SUM(lookup!$B$23)*F5","v":0},null,{"$f":"SUM(lookup!$B$24)*H5","v":0},null,{"$f":"SUM(lookup!$B$25)*J5","v":0},null,{"$f":"SUM(lookup!$B$26)*L5","v":0},null,{"$f":"SUM(lookup!$B$27)*N5","v":0},null,{"$f":"SUM(lookup!$B$28)*P5","v":0}]
[{"$f":"+A5+1","v":"1900-01-01"},4,{"$f":"SUM(lookup!$B$21)*B6","v":2400},3,{"$f":"SUM(lookup!$B$22)*D6","v":1200},null,{"$f":"SUM(lookup!$B$23)*F6","v":0},null,{"$f":"SUM(lookup!$B$24)*H6","v":0},null,{"$f":"SUM(lookup!$B$25)*J6","v":0},null,{"$f":"SUM(lookup!$B$26)*L6","v":0},null,{"$f":"SUM(lookup!$B$27)*N6","v":0},null,{"$f":"SUM(lookup!$B$28)*P6","v":0}]
[{"$f":"+A6+1","v":"1900-01-02"},4,{"$f":"SUM(lookup!$B$21)*B7","v":2400},3,{"$f":"SUM(lookup!$B$22)*D7","v":1200},null,{"$f":"SUM(lookup!$B$23)*F7","v":0},null,{"$f":"SUM(lookup!$B$24)*H7","v":0},null,{"$f":"SUM(lookup!$B$25)*J7","v":0},null,{"$f":"SUM(lookup!$B$26)*L7","v":0},null,{"$f":"SUM(lookup!$B$27)*N7","v":0},null,{"$f":"SUM(lookup!$B$28)*P7","v":0}]
[{"$f":"+A7+1","v":"1900-01-03"},4,{"$f":"SUM(lookup!$B$21)*B8","v":2400},3,{"$f":"SUM(lookup!$B$22)*D8","v":1200},null,{"$f":"SUM(lookup!$B$23)*F8","v":0},null,{"$f":"SUM(lookup!$B$24)*H8","v":0},null,{"$f":"SUM(lookup!$B$25)*J8","v":0},null,{"$f":"SUM(lookup!$B$26)*L8","v":0},null,{"$f":"SUM(lookup!$B$27)*N8","v":0},null,{"$f":"SUM(lookup!$B$28)*P8","v":0}]
[{"$f":"+A8+1","v":"1900-01-04"},4,{"$f":"SUM(lookup!$B$21)*B9","v":2400},4,{"$f":"SUM(lookup!$B$22)*D9","v":1600},null,{"$f":"SUM(lookup!$B$23)*F9","v":0},null,{"$f":"SUM(lookup!$B$24)*H9","v":0},null,{"$f":"SUM(lookup!$B$25)*J9","v":0},null,{"$f":"SUM(lookup!$B$26)*L9","v":0},null,{"$f":"SUM(lookup!$B$27)*N9","v":0},null,{"$f":"SUM(lookup!$B$28)*P9","v":0}]
["1900-01-05",4,{"$f":"SUM(lookup!$B$21)*B10","v":2400},4,{"$f":"SUM(lookup!$B$22)*D10","v":1600},null,{"$f":"SUM(lookup!$B$23)*F10","v":0},null,{"$f":"SUM(lookup!$B$24)*H10","v":0},null,{"$f":"SUM(lookup!$B$25)*J10","v":0},null,{"$f":"SUM(lookup!$B$26)*L10","v":0},null,{"$f":"SUM(lookup!$B$27)*N10","v":0},null,{"$f":"SUM(lookup!$B$28)*P10","v":0}]
{"$rows_left_out":9}
{"sheet":"Mailing.list","index":8,"n_rows":19,"n_cols":6,"rows_kept":19,"cut":false,"hidden":false,"merged":[]}
[]
["Below is the standard list to begin your activation mailing list. You may want to add/subract from this list."]
["Some possible additions are contacts at the region/forest, yourself (to verify it's working), others on your cadre."]
[" "]
["Address",null,null,null,null,"Explanation"]
["warren2750@gmail.com",null,null,null,null,"Mike Warren (helping with spreadsheet problems and reporting)"]
[null,null,null,null,null,"Ass't Center Manager-NICC"]
["sfisher01@fs.fed.us",null,null,null,null,"Acting MAFFS Training Coordinator"]
["bbilyeu@fs.fed.us",null,null,null,null,"Financial Manager-NIFC"]
["intell@nifc.blm.gov",null,null,null,null,"NICC Intell Desk"]
{"$rows_left_out":10}
{"sheet":"Changes","index":9,"n_rows":40,"n_cols":4,"rows_kept":40,"cut":false,"hidden":true,"merged":[]}
["Changes made by Darlene:"]
[]
["TAB","COLUMN","ROW","CHANGE MADE"]
[]
["Tab Mailing.list",null,"2,3,4","Entered explanations on possible changes people should make to the stardardized mailing list"]
["Tab Mailing.list","C",18,"Have people fill in their operating \"location\" here, and it will auto fill on sheets 3,5,6,7"]
["7. DATA","i",null,"Added formula so no entry is needed (this is filled in by formula from columns f,g,h)"]
["7. DATA","i",null,"Changed header to indicate there is no entry required in this column"]
["3. MAFFS Military Costs","k,l,m,n","all","Changed flight hour costs to $5186 + $1600 (extraordinary mtnc)"]
["Tab Mailing.list",null,"all","Added ASC to standard mailing list for all costs (11/16/07) dm"]
{"$rows_left_out":31}
{"sheet":"Instructions","index":10,"n_rows":23,"n_cols":5,"rows_kept":23,"cut":false,"hidden":false,"merged":[[22,1,23,14],[12,2,12,14],[21,1,21,14],[20,1,20,14],[10,1,10,14],[13,1,13,14],[19,1,19,14],[15,1,15,14],[14,1,14,14],[16,1,16,14],[18,1,18,14],[11,2,11,14],[17,2,17,14]]}
[]
[]
[]
[]
[null,null,null,null,"Instructions for Completion of Workbook"]
[null,null,null,null,"Version 2.1.2011 (updated for 2011 operating season)"]
[]
[]
["1.","Enter your operating location in cell C19 of the Mailing.List tab.  That entry will then automatically populate all other \"Location\" occurrences."]
["2.","On the Mailing.List tab, verify your mailing list for report distribution and make appropriate changes."]
{"$rows_left_out":14}
{"sheet":"lookup","index":11,"n_rows":28,"n_cols":5,"rows_kept":28,"cut":false,"hidden":true,"merged":[]}
[]
[]
["MLO",600]
["AMLO",550]
["AMLO-T",500]
["MABM",440]
["MABS or MABS-T",440]
["Procurement",440]
["MAFFS Clerk",400]
["Ground Support",350]
{"$rows_left_out":18}